*KEYWORD
*CONTROL_TERMINATION
*DATABASE_BINARY_D3PLOT
*SENSOR_DEFINE_NODE
         1         5        29         Z               COORD
*SENSOR_SWITCH
         1    Sensor         1        LT        16
*SENSOR_CONTROL
         1  DISC-ELE         1
        On         1
*PART
*PART
*PART
*PART
*SECTION_SOLID
*SECTION_DISCRETE
*SECTION_SHELL
*MAT_ELASTIC
*MAT_SPRING_ELASTIC
*MAT_RIGID
*LOAD_NODE_POINT
*CONTACT_AUTOMATIC_GENERAL_ID
*DEFINE_CURVE
*ELEMENT_DISCRETE
*ELEMENT_SHELL
*ELEMENT_SOLID
*BOUNDARY_SPC_NODE
*NODE
*END