*KEYWORD
*control_timestep
*database_binary_d3plot
*database_bndout
*control_termination
$*boundary_prescribed_orientation_rigid_angles
$1, 5, 1
$1, 2, 2, 123, 0
*initial_velocity_generation
*boundary_prescribed_motion_rigid_local
*define_curve
*define_curve
*define_curve
*DEFINE_COORDINATE_SYSTEM
*NODE
*MAT_020_TITLE
initial
*MAT_020_TITLE
final
*PART
initial solid
initial beam
final_solid
final beam
*CONSTRAINED_RIGID_BODIES
*SECTION_BEAM
*SECTION_SOLID
*NODE
*ELEMENT_BEAM
*ELEMENT_SOLID
*part
elastic
*mat_elastic
*section_beam
*element_beam
*node
*END